Reaction Details
TargetAndrogen receptor
LigandBDBM18668
Substrate/CompetitorBDBM26258
Meas. Tech.Competitive Radioligand Displacement Assay
pH7.4±n/a
Temperature277.15±n/a K
Ki 9.56±0.66 nM
CommentsCompound nM stimulates transcription to 64.01 % of that observed with 1 nM DHT.
Citation Marhefka, CAGao, WChung, KKim, JHe, YYin, DBohl, CDalton, JTMiller, DD Design, synthesis, and biological characterization of metabolically stable selective androgen receptor modulators. J Med Chem47:993-8 (2004) 
 
Androgen receptor
Name:Androgen receptor
Type:Enzyme
Mol. Mass.:98219.08
Organism:Rattus norvegicus (Rat)
Description:P15207
Residue:902
BDBM18668
BDBM26258
NameBDBM18668
Synonyms:(2S)-3-(4-chlorophenoxy)-2-hydroxy-2-methyl-N-[4-nitro-3-(trifluoromethyl)phenyl]propanamide | Nonsteroidal AR Ligand, S-9
TypeSmall organic molecule
Emp. Form.C17H14ClF3N2O5
Mol. Mass.418.752
SMILESC[C@](O)(COc1ccc(Cl)cc1)C(=O)Nc1ccc(c(c1)C(F)(F)F)[N+]([O-])=O