Reaction Details
TargetAndrogen receptor
LigandBDBM18671
Substrate/CompetitorBDBM26258
Meas. Tech.Competitive Radioligand Displacement Assay
pH7.4±n/a
Temperature277.15±n/a K
Ki 34.77±3.5 nM
CommentsCompound nM stimulates transcription to 8.95 % of that observed with 1 nM DHT.
Citation Marhefka, CAGao, WChung, KKim, JHe, YYin, DBohl, CDalton, JTMiller, DD Design, synthesis, and biological characterization of metabolically stable selective androgen receptor modulators. J Med Chem47:993-8 (2004) 
 
Androgen receptor
Name:Androgen receptor
Type:Enzyme
Mol. Mass.:98219.08
Organism:Rattus norvegicus (Rat)
Description:P15207
Residue:902
BDBM18671
BDBM26258
NameBDBM18671
Synonyms:(2S)-2-hydroxy-2-methyl-3-(4-methylphenoxy)-N-[4-nitro-3-(trifluoromethyl)phenyl]propanamide | Nonsteroidal AR Ligand, S-12
TypeSmall organic molecule
Emp. Form.C18H17F3N2O5
Mol. Mass.398.3332
SMILESCc1ccc(OC[C@](C)(O)C(=O)Nc2ccc(c(c2)C(F)(F)F)[N+]([O-])=O)cc1