Reaction Details
TargetAndrogen receptor
LigandBDBM18691
Substrate/CompetitorBDBM26258
Meas. Tech.Competitive Radioligand Displacement Assay
pH7.4±n/a
Temperature277.15±n/a K
Ki 360±30 nM
Citation Kirkovsky, LMukherjee, AYin, DDalton, JTMiller, DD Chiral nonsteroidal affinity ligands for the androgen receptor. 1. Bicalutamide analogues bearing electrophilic groups in the B aromatic ring. J Med Chem43:581-90 (2000) 
 
Androgen receptor
Name:Androgen receptor
Type:Enzyme
Mol. Mass.:98219.08
Organism:Rattus norvegicus (Rat)
Description:P15207
Residue:902
BDBM18691
BDBM26258
NameBDBM18691
Synonyms:(2R)-3-{[4-(2-bromoacetamido)benzene]sulfonyl}-N-[4-cyano-3-(trifluoromethyl)phenyl]-2-hydroxy-2-methylpropanamide | Bicalutamide Analogue, (R)-17
TypeSmall organic molecule
Emp. Form.C20H17BrF3N3O5S
Mol. Mass.548.33
SMILESC[C@](O)(CS(=O)(=O)c1ccc(NC(=O)CBr)cc1)C(=O)Nc1ccc(C#N)c(c1)C(F)(F)F