Reaction Details
TargetAndrogen receptor
LigandBDBM18693
Substrate/CompetitorBDBM26258
Meas. Tech.Competitive Radioligand Displacement Assay
pH7.4±n/a
Temperature277.15±n/a K
Ki 800±n/a nM
Citation Kirkovsky, LMukherjee, AYin, DDalton, JTMiller, DD Chiral nonsteroidal affinity ligands for the androgen receptor. 1. Bicalutamide analogues bearing electrophilic groups in the B aromatic ring. J Med Chem43:581-90 (2000) 
 
Androgen receptor
Name:Androgen receptor
Type:Enzyme
Mol. Mass.:98219.08
Organism:Rattus norvegicus (Rat)
Description:P15207
Residue:902
BDBM18693
BDBM26258
NameBDBM18693
Synonyms:(2S)-3-[(4-aminophenyl)sulfanyl]-N-[4-cyano-3-(trifluoromethyl)phenyl]-2-hydroxy-2-methylpropanamide | Bicalutamide Analogue, (S)-5
TypeSmall organic molecule
Emp. Form.C18H16F3N3O2S
Mol. Mass.395.399
SMILESC[C@@](O)(CSc1ccc(N)cc1)C(=O)Nc1ccc(C#N)c(c1)C(F)(F)F