Reaction Details
TargetAndrogen receptor
LigandBDBM18685
Substrate/CompetitorBDBM26258
Meas. Tech.Competitive Radioligand Displacement Assay and AR-Mediated Transcription Activation Assay
pH7.4±n/a
Temperature277.15±n/a K
Ki 1.65±0.1 nM
EC50 100±n/a nM
CommentsMaximal percentage of transcriptional activation observed is 97.5 +/- 21.6 %
Citation Dalton, JTMukherjee, AZhu, ZKirkovsky, LMiller, DD Discovery of nonsteroidal androgens. Biochem Biophys Res Commun244:1-4 (1998) 
 
Androgen receptor
Name:Androgen receptor
Type:Enzyme
Mol. Mass.:98219.08
Organism:Rattus norvegicus (Rat)
Description:P15207
Residue:902
BDBM18685
BDBM26258
NameBDBM18685
Synonyms:(2R)-3-{[4-(2-chloroacetamido)phenyl]sulfanyl}-N-[4-cyano-3-(trifluoromethyl)phenyl]-2-hydroxy-2-methylpropanamide CHEMBL333745
TypeSmall organic molecule
Emp. Form.C20H17ClF3N3O3S
Mol. Mass.471.88
SMILESC[C@](O)(CSc1ccc(NC(=O)CCl)cc1)C(=O)Nc1ccc(C#N)c(c1)C(F)(F)F