Reaction Details
TargetAndrogen receptor
LigandBDBM18698
Substrate/CompetitorBDBM26258
Meas. Tech.Competitive Radioligand Displacement Assay and AR-Mediated Transcription Activation Assay
pH7.4±n/a
Temperature277.15±n/a K
Ki 7.98±0.86 nM
EC50 500±n/a nM
CommentsMaximal percentage of transcriptional activation observed is 18.5 +/- 5.08 %
Citation Dalton, JTMukherjee, AZhu, ZKirkovsky, LMiller, DD Discovery of nonsteroidal androgens. Biochem Biophys Res Commun244:1-4 (1998) 
 
Androgen receptor
Name:Androgen receptor
Type:Enzyme
Mol. Mass.:98219.08
Organism:Rattus norvegicus (Rat)
Description:P15207
Residue:902
BDBM18698
BDBM26258
NameBDBM18698
Synonyms:(2R)-3-bromo-N-[4-cyano-3-(trifluoromethyl)phenyl]-2-hydroxy-2-methylpropanamide | R-2
TypeSmall organic molecule
Emp. Form.C12H10BrF3N2O2
Mol. Mass.351.119
SMILESC[C@](O)(CBr)C(=O)Nc1ccc(C#N)c(c1)C(F)(F)F