Reaction Details
TargetThymidylate synthase
LigandBDBM18763
Substrate/CompetitorBDBM18754
Meas. Tech.Thymidylate Synthase (TS) Assay
pH7.4±n/a
Temperature293.15±n/a K
Ki 700±n/a nM
CommentsCompound showed null or very low toxicity in the cytotoxicity test against gram-positive and gram-negative wild-type bacterial strains.
Citation Costi, MPGelain, ABarlocco, DGhelli, SSoragni, FReniero, FRossi, TRuberto, AGuillou, CCavazzuti, ACasolari, CFerrari, S Antibacterial agent discovery using thymidylate synthase biolibrary screening. J Med Chem49:5958-68 (2006) 
 
Thymidylate synthase
Name:Thymidylate synthase
Type:Enzyme
Mol. Mass.:36576.54
Organism:Lactobacillus casei
Description:n/a
Residue:316
BDBM18763
BDBM18754
NameBDBM18763
Synonyms:1,8-naphthalein derivative, 10 A15 Alpha 156 | CHEMBL67116
TypeSmall organic molecule
Emp. Form.C24H14Cl2O4
Mol. Mass.437.272
SMILESOc1ccc(cc1Cl)C1(OC(=O)c2cccc3cccc1c23)c1ccc(O)c(Cl)c1