Reaction Details
TargetThymidylate synthase
LigandBDBM18757
Substrate/CompetitorBDBM18754
Meas. Tech.Thymidylate Synthase (TS) Assay
pH7.4±n/a
Temperature293.15±n/a K
Ki 1500±n/a nM
Citation Costi, MPGelain, ABarlocco, DGhelli, SSoragni, FReniero, FRossi, TRuberto, AGuillou, CCavazzuti, ACasolari, CFerrari, S Antibacterial agent discovery using thymidylate synthase biolibrary screening. J Med Chem49:5958-68 (2006) 
 
Thymidylate synthase
Name:Thymidylate synthase
Type:Enzyme
Mol. Mass.:30475.81
Organism:Escherichia coli
Description:n/a
Residue:264
BDBM18757
BDBM18754
NameBDBM18757
Synonyms:1,2-naphthalein derivative, 3 | 3,3-bis(4-hydroxy-3-iodophenyl)-4-oxatricyclo[7.4.0.0^{2,6}]trideca-1(9),2(6),7,10,12-pentaen-5-one
TypeSmall organic molecule
Emp. Form.C24H14I2O4
Mol. Mass.620.1745
SMILESOc1ccc(cc1I)C1(OC(=O)c2ccc3ccccc3c12)c1ccc(O)c(I)c1