Reaction Details
TargetThymidylate synthase
LigandBDBM18768
Substrate/CompetitorBDBM18754
Meas. Tech.Thymidylate Synthase (TS) Assay
Ki>11000000±n/a nM
Citation Costi, MPGelain, ABarlocco, DGhelli, SSoragni, FReniero, FRossi, TRuberto, AGuillou, CCavazzuti, ACasolari, CFerrari, S Antibacterial agent discovery using thymidylate synthase biolibrary screening. J Med Chem49:5958-68 (2006) 
 
Thymidylate synthase
Name:Thymidylate synthase
Type:Enzyme
Mol. Mass.:30475.81
Organism:Escherichia coli
Description:n/a
Residue:264
BDBM18768
BDBM18754
NameBDBM18768
Synonyms:1,8-naphthalein derivative, 15 | 4,4-bis(3,5-dibromo-4-hydroxyphenyl)-3-oxatricyclo[7.3.1.0^{5,13}]trideca-1(12),5,7,9(13),10-pentaen-2-one
TypeSmall organic molecule
Emp. Form.C24H12Br4O4
Mol. Mass.683.966
SMILESOc1c(Br)cc(cc1Br)C1(OC(=O)c2cccc3cccc1c23)c1cc(Br)c(O)c(Br)c1