Reaction Details
TargetThymidylate synthase
LigandBDBM18764
Substrate/CompetitorBDBM18754
Meas. Tech.Thymidylate Synthase (TS) Assay
Ki 9600±n/a nM
Citation Costi, MPGelain, ABarlocco, DGhelli, SSoragni, FReniero, FRossi, TRuberto, AGuillou, CCavazzuti, ACasolari, CFerrari, S Antibacterial agent discovery using thymidylate synthase biolibrary screening. J Med Chem49:5958-68 (2006) 
 
Thymidylate synthase
Name:Thymidylate synthase
Type:Enzyme
Mol. Mass.:35863.57
Organism:Cryptococcus neoformans
Description:n/a
Residue:317
BDBM18764
BDBM18754
NameBDBM18764
Synonyms:1,8-naphthalein derivative, 11 CHEMBL294280
TypeSmall organic molecule
Emp. Form.C24H13Cl3O4
Mol. Mass.471.717
SMILESOc1ccc(cc1Cl)C1(OC(=O)c2cccc3c(Cl)ccc1c23)c1ccc(O)c(Cl)c1