Reaction Details
TargetThymidylate synthase
LigandBDBM18765
Substrate/CompetitorBDBM18754
Meas. Tech.Thymidylate Synthase (TS) Assay
Ki 3300±n/a nM
Citation Costi, MPGelain, ABarlocco, DGhelli, SSoragni, FReniero, FRossi, TRuberto, AGuillou, CCavazzuti, ACasolari, CFerrari, S Antibacterial agent discovery using thymidylate synthase biolibrary screening. J Med Chem49:5958-68 (2006) 
 
Thymidylate synthase
Name:Thymidylate synthase
Type:Enzyme
Mol. Mass.:35863.57
Organism:Cryptococcus neoformans
Description:n/a
Residue:317
BDBM18765
BDBM18754
NameBDBM18765
Synonyms:1,8-naphthalein derivative, 12 | 4,4-bis(3,5-dichloro-4-hydroxyphenyl)-3-oxatricyclo[7.3.1.0^{5,13}]trideca-1(12),5,7,9(13),10-pentaen-2-one
TypeSmall organic molecule
Emp. Form.C24H12Cl4O4
Mol. Mass.506.162
SMILESOc1c(Cl)cc(cc1Cl)C1(OC(=O)c2cccc3cccc1c23)c1cc(Cl)c(O)c(Cl)c1