Reaction Details
TargetThymidylate synthase
LigandBDBM18767
Substrate/CompetitorBDBM18754
Meas. Tech.Thymidylate Synthase (TS) Assay
Ki 13000±n/a nM
Citation Costi, MPGelain, ABarlocco, DGhelli, SSoragni, FReniero, FRossi, TRuberto, AGuillou, CCavazzuti, ACasolari, CFerrari, S Antibacterial agent discovery using thymidylate synthase biolibrary screening. J Med Chem49:5958-68 (2006) 
 
Thymidylate synthase
Name:Thymidylate synthase
Type:Enzyme
Mol. Mass.:35863.57
Organism:Cryptococcus neoformans
Description:n/a
Residue:317
BDBM18767
BDBM18754
NameBDBM18767
Synonyms:1,8-naphthalein derivative, 14 | 4,4-bis(3-bromo-4-hydroxyphenyl)-3-oxatricyclo[7.3.1.0^{5,13}]trideca-1(12),5,7,9(13),10-pentaen-2-one
TypeSmall organic molecule
Emp. Form.C24H14Br2O4
Mol. Mass.526.174
SMILESOc1ccc(cc1Br)C1(OC(=O)c2cccc3cccc1c23)c1ccc(O)c(Br)c1