Reaction Details
TargetDihydrofolate reductase
LigandBDBM18756
Substrate/CompetitorBDBM18044
Meas. Tech.Thymidylate Synthase (TS) Assay
Ki 35000±n/a nM
Citation Costi, MPGelain, ABarlocco, DGhelli, SSoragni, FReniero, FRossi, TRuberto, AGuillou, CCavazzuti, ACasolari, CFerrari, S Antibacterial agent discovery using thymidylate synthase biolibrary screening. J Med Chem49:5958-68 (2006) 
 
Dihydrofolate reductase
Name:Dihydrofolate reductase
Type:Enzyme
Mol. Mass.:21453.99
Organism:Homo sapiens (Human)
Description:Recombinant human DHFR.
Residue:187
BDBM18756
BDBM18044
NameBDBM18756
Synonyms:1,2-naphthalein derivative, 2 | 5,5-bis(4-hydroxyphenyl)-4-oxatricyclo[7.4.0.0^{2,6}]trideca-1(9),2(6),7,10,12-pentaen-3-one
TypeSmall organic molecule
Emp. Form.C24H16O4
Mol. Mass.368.3814
SMILESOc1ccc(cc1)C1(OC(=O)c2c1ccc1ccccc21)c1ccc(O)cc1