Reaction Details
TargetDihydrofolate reductase
LigandBDBM18772
Substrate/CompetitorBDBM18044
Meas. Tech.Thymidylate Synthase (TS) Assay
Ki 13000±n/a nM
Citation Costi, MPGelain, ABarlocco, DGhelli, SSoragni, FReniero, FRossi, TRuberto, AGuillou, CCavazzuti, ACasolari, CFerrari, S Antibacterial agent discovery using thymidylate synthase biolibrary screening. J Med Chem49:5958-68 (2006) 
 
Dihydrofolate reductase
Name:Dihydrofolate reductase
Type:Enzyme
Mol. Mass.:21453.99
Organism:Homo sapiens (Human)
Description:Recombinant human DHFR.
Residue:187
BDBM18772
BDBM18044
NameBDBM18772
Synonyms:1,8-naphthalein derivative, 16 Phenolnaphthalein derivative, 2
TypeSmall organic molecule
Emp. Form.C24H13Br2ClO4
Mol. Mass.560.619
SMILESOc1ccc(cc1Br)C1(OC(=O)c2cccc3c(Cl)ccc1c23)c1ccc(O)c(Br)c1