Reaction Details
TargetDihydrofolate reductase
LigandBDBM18770
Substrate/CompetitorBDBM18044
Meas. Tech.Thymidylate Synthase (TS) Assay
Ki 12000±n/a nM
Citation Costi, MPGelain, ABarlocco, DGhelli, SSoragni, FReniero, FRossi, TRuberto, AGuillou, CCavazzuti, ACasolari, CFerrari, S Antibacterial agent discovery using thymidylate synthase biolibrary screening. J Med Chem49:5958-68 (2006) 
 
Dihydrofolate reductase
Name:Dihydrofolate reductase
Type:Enzyme
Mol. Mass.:21453.99
Organism:Homo sapiens (Human)
Description:Recombinant human DHFR.
Residue:187
BDBM18770
BDBM18044
NameBDBM18770
Synonyms:1,8-naphthalein derivative, 18 Phenolnaphthalein derivative, 3
TypeSmall organic molecule
Emp. Form.C24H13ClF2O4
Mol. Mass.438.807
SMILESOc1ccc(cc1F)C1(OC(=O)c2cccc3c(Cl)ccc1c23)c1ccc(O)c(F)c1