Reaction Details
TargetPlatelet-derived growth factor receptor beta
LigandBDBM139545
Substrate/Competitorn/a
Meas. Tech.Kinase Assay
Ki 26.0±n/a nM
Citation Hull, III, CEMalone, TC Method of treating conditions with kinase inhibitors US Patent US9820989 Publication Date 11/21/2017
 
Platelet-derived growth factor receptor beta
Name:Platelet-derived growth factor receptor beta
Type:Enzyme
Mol. Mass.:123922.25
Organism:Homo sapiens (Human)
Description:P09619
Residue:1106
BDBM139545
NameBDBM139545
Synonyms:US8889870, 5 US9820989, 5
TypeSmall organic molecule
Emp. Form.C21H18F3N5O
Mol. Mass.413.3957
SMILESNc1ncc2CN(CCc2n1)c1cccc(c1)C(=O)Nc1cccc(c1)C(F)(F)F