Reaction Details
TargetPlatelet-derived growth factor receptor beta
LigandBDBM139547
Substrate/Competitorn/a
Meas. Tech.Kinase Assay
Ki 1240±n/a nM
Citation Hull, III, CEMalone, TC Method of treating conditions with kinase inhibitors US Patent US9820989 Publication Date 11/21/2017
 
Platelet-derived growth factor receptor beta
Name:Platelet-derived growth factor receptor beta
Type:Enzyme
Mol. Mass.:123922.25
Organism:Homo sapiens (Human)
Description:P09619
Residue:1106
BDBM139547
NameBDBM139547
Synonyms:US8889870, 7 US9820989, 7
TypeSmall organic molecule
Emp. Form.C21H21N5O2
Mol. Mass.375.4237
SMILESCOc1cccc(NC(=O)c2cccc(c2)N2CCc3nc(N)ncc3C2)c1