Reaction Details
TargetVascular endothelial growth factor receptor 2
LigandBDBM139549
Substrate/Competitorn/a
Meas. Tech.Kinase Assay
Ki 22.0±n/a nM
Citation Hull, III, CEMalone, TC Method of treating conditions with kinase inhibitors US Patent US9820989 Publication Date 11/21/2017
 
Vascular endothelial growth factor receptor 2
Name:Vascular endothelial growth factor receptor 2
Type:Receptor Tyrosine Kinase
Mol. Mass.:151510.97
Organism:Homo sapiens (Human)
Description:P35968
Residue:1356
BDBM139549
NameBDBM139549
Synonyms:US8889870, 9 US9820989, 9
TypeSmall organic molecule
Emp. Form.C22H23N5O
Mol. Mass.373.4509
SMILESCCc1cccc(NC(=O)c2cccc(c2)N2CCc3nc(N)ncc3C2)c1