Reaction Details
TargetPlatelet-derived growth factor receptor beta
LigandBDBM139550
Substrate/Competitorn/a
Meas. Tech.Kinase Assay
Ki 32.0±n/a nM
Citation Hull, III, CEMalone, TC Method of treating conditions with kinase inhibitors US Patent US9820989 Publication Date 11/21/2017
 
Platelet-derived growth factor receptor beta
Name:Platelet-derived growth factor receptor beta
Type:Enzyme
Mol. Mass.:123922.25
Organism:Homo sapiens (Human)
Description:P09619
Residue:1106
BDBM139550
NameBDBM139550
Synonyms:US8889870, 10 US9820989, 10
TypeSmall organic molecule
Emp. Form.C23H25N5O
Mol. Mass.387.4775
SMILESCCCc1ccc(NC(=O)c2cccc(c2)N2CCc3nc(N)ncc3C2)cc1