Reaction Details
TargetPlatelet-derived growth factor receptor beta
LigandBDBM139552
Substrate/Competitorn/a
Meas. Tech.Kinase Assay
Ki 24.0±n/a nM
Citation Hull, III, CEMalone, TC Method of treating conditions with kinase inhibitors US Patent US9820989 Publication Date 11/21/2017
 
Platelet-derived growth factor receptor beta
Name:Platelet-derived growth factor receptor beta
Type:Enzyme
Mol. Mass.:123922.25
Organism:Homo sapiens (Human)
Description:P09619
Residue:1106
BDBM139552
NameBDBM139552
Synonyms:US8889870, 12 US9820989, 12
TypeSmall organic molecule
Emp. Form.C23H25N5O
Mol. Mass.387.4775
SMILESCC(C)c1ccc(NC(=O)c2cccc(c2)N2CCc3nc(N)ncc3C2)cc1