Reaction Details
TargetVascular endothelial growth factor receptor 2
LigandBDBM139556
Substrate/Competitorn/a
Meas. Tech.Kinase Assay
Ki>1000±n/a nM
Citation Hull, III, CEMalone, TC Method of treating conditions with kinase inhibitors US Patent US9820989 Publication Date 11/21/2017
 
Vascular endothelial growth factor receptor 2
Name:Vascular endothelial growth factor receptor 2
Type:Receptor Tyrosine Kinase
Mol. Mass.:151510.97
Organism:Homo sapiens (Human)
Description:P35968
Residue:1356
BDBM139556
NameBDBM139556
Synonyms:US8889870, 16 US9820989, 16
TypeSmall organic molecule
Emp. Form.C18H23N5O
Mol. Mass.325.4081
SMILESCCCCNC(=O)c1cccc(c1)N1CCc2nc(N)ncc2C1