Reaction Details
TargetPlatelet-derived growth factor receptor beta
LigandBDBM139568
Substrate/Competitorn/a
Meas. Tech.Kinase Assay
Ki>10000±n/a nM
Citation Hull, III, CEMalone, TC Method of treating conditions with kinase inhibitors US Patent US9820989 Publication Date 11/21/2017
 
Platelet-derived growth factor receptor beta
Name:Platelet-derived growth factor receptor beta
Type:Enzyme
Mol. Mass.:123922.25
Organism:Homo sapiens (Human)
Description:P09619
Residue:1106
BDBM139568
NameBDBM139568
Synonyms:US8889870, 37 US9820989, 37
TypeSmall organic molecule
Emp. Form.C20H20N6O
Mol. Mass.360.4124
SMILESCc1cccc(NC(=O)c2cccc(n2)N2CCc3nc(N)ncc3C2)c1