Reaction Details
TargetPlatelet-derived growth factor receptor beta
LigandBDBM139601
Substrate/Competitorn/a
Meas. Tech.Kinase Assay
Ki 20.0±n/a nM
Citation Hull, III, CEMalone, TC Method of treating conditions with kinase inhibitors US Patent US9820989 Publication Date 11/21/2017
 
Platelet-derived growth factor receptor beta
Name:Platelet-derived growth factor receptor beta
Type:Enzyme
Mol. Mass.:123922.25
Organism:Homo sapiens (Human)
Description:P09619
Residue:1106
BDBM139601
NameBDBM139601
Synonyms:US8889870, 147 | US9820989, 147
TypeSmall organic molecule
Emp. Form.C22H20F3N5O
Mol. Mass.427.4223
SMILESCc1ccc(cc1N1CCc2nc(N)ncc2C1)C(=O)Nc1cccc(c1)C(F)(F)F