Reaction Details
TargetPlatelet-derived growth factor receptor beta
LigandBDBM139603
Substrate/Competitorn/a
Meas. Tech.Kinase Assay
Ki 30.0±n/a nM
Citation Hull, III, CEMalone, TC Method of treating conditions with kinase inhibitors US Patent US9820989 Publication Date 11/21/2017
 
Platelet-derived growth factor receptor beta
Name:Platelet-derived growth factor receptor beta
Type:Enzyme
Mol. Mass.:123922.25
Organism:Homo sapiens (Human)
Description:P09619
Residue:1106
BDBM139603
NameBDBM139603
Synonyms:US8889870, 149 US9820989, 149
TypeSmall organic molecule
Emp. Form.C24H27N5O
Mol. Mass.401.5041
SMILESCC(C)c1cccc(NC(=O)c2ccc(C)c(c2)N2CCc3nc(N)ncc3C2)c1