Reaction Details
TargetVascular endothelial growth factor receptor 2
LigandBDBM139620
Substrate/Competitorn/a
Meas. Tech.Kinase Assay
Ki 39.0±n/a nM
Citation Hull, III, CEMalone, TC Method of treating conditions with kinase inhibitors US Patent US9820989 Publication Date 11/21/2017
 
Vascular endothelial growth factor receptor 2
Name:Vascular endothelial growth factor receptor 2
Type:Receptor Tyrosine Kinase
Mol. Mass.:151510.97
Organism:Homo sapiens (Human)
Description:P35968
Residue:1356
BDBM139620
NameBDBM139620
Synonyms:US8889870, 168 US9820989, 168
TypeSmall organic molecule
Emp. Form.C24H25N3O
Mol. Mass.371.4748
SMILESCC(C)c1cccc(NC(=O)c2cccc(c2)N2CCc3ccncc3C2)c1