Reaction Details
TargetPlatelet-derived growth factor receptor beta
LigandBDBM139620
Substrate/Competitorn/a
Meas. Tech.Kinase Assay
Ki 40.0±n/a nM
Citation Hull, III, CEMalone, TC Method of treating conditions with kinase inhibitors US Patent US9820989 Publication Date 11/21/2017
 
Platelet-derived growth factor receptor beta
Name:Platelet-derived growth factor receptor beta
Type:Enzyme
Mol. Mass.:123922.25
Organism:Homo sapiens (Human)
Description:P09619
Residue:1106
BDBM139620
NameBDBM139620
Synonyms:US8889870, 168 US9820989, 168
TypeSmall organic molecule
Emp. Form.C24H25N3O
Mol. Mass.371.4748
SMILESCC(C)c1cccc(NC(=O)c2cccc(c2)N2CCc3ccncc3C2)c1