Reaction Details
TargetFatty-acid amide hydrolase 1 [30-579]
LigandBDBM359717
Substrate/Competitorn/a
Meas. Tech.Radiometric Assay
IC50 1.40±n/a nM
Citation Piomelli, DBandiera, TScarpelli, R Inhibitors of fatty acid amide hydrolase (FAAH) enzyme with improved oral bioavailability and their use as medicaments US Patent US9822068 Publication Date 11/21/2017
 
Fatty-acid amide hydrolase 1 [30-579]
Name:Fatty-acid amide hydrolase 1 [30-579]
Type:Single-pass membrane protein; homodimer
Mol. Mass.:60474.00
Organism:Rattus norvegicus (rat)
Description:P97612 (aa 30-579)
Residue:550
BDBM359717
NameBDBM359717
Synonyms:US10435355, Example 1 [4-fluoro-3-[3- (methylcarbamoyl)phenyl] phenyl]N- cyclohexylcarbamate
TypeSmall organic molecule
Emp. Form.C21H23FN2O3
Mol. Mass.370.4173
SMILESCNC(=O)c1cccc(c1)-c1cc(OC(=O)NC2CCCCC2)ccc1F