Reaction Details
TargetFatty-acid amide hydrolase 1
LigandBDBM359719
Substrate/Competitorn/a
Meas. Tech.Fluorescent Assay
IC50 1.80±n/a nM
Citation Piomelli, DBandiera, TScarpelli, R Inhibitors of fatty acid amide hydrolase (FAAH) enzyme with improved oral bioavailability and their use as medicaments US Patent US9822068 Publication Date 11/21/2017
 
Fatty-acid amide hydrolase 1
Name:Fatty-acid amide hydrolase 1
Type:Protein
Mol. Mass.:63071.19
Organism:Homo sapiens (Human)
Description:O00519
Residue:579
BDBM359719
NameBDBM359719
Synonyms:US10435355, Example 3 [3-(3-carbamoylphenyl)-4- fluoro-phenyl]N- cyclobutylcarbamate
TypeSmall organic molecule
Emp. Form.C18H17FN2O3
Mol. Mass.328.3376
SMILESNC(=O)c1cccc(c1)-c1cc(OC(=O)NC2CCC2)ccc1F