Reaction Details
TargetBifunctional dihydrofolate reductase-thymidylate synthase [1-238,S58R,S117N]
LigandBDBM18781
Substrate/CompetitorBDBM18044
Meas. Tech.Inhibitor Screening Using Bacterial System (IC50) and Measurement of Inhibition Constant (Ki)
Ki 6.59±n/a nM
IC50 30050±n/a nM
Citation Bunyarataphan, SLeartsakulpanich, UTaweechai, STarnchompoo, BKamchonwongpaisan, SYuthavong, Y Evaluation of the activities of pyrimethamine analogs against Plasmodium vivax and Plasmodium falciparum dihydrofolate reductase-thymidylate synthase using in vitro enzyme inhibition and bacterial complementation assays. Antimicrob Agents Chemother50:3631-7 (2006) 
 
Bifunctional dihydrofolate reductase-thymidylate synthase [1-238,S58R,S117N]
Name:Bifunctional dihydrofolate reductase-thymidylate synthase [1-238,S58R,S117N]
Type:Enzyme
Mol. Mass.:27235.37
Organism:Plasmodium vivax (malaria parasite P. vivax)
Description:O02604[1-238,S58R,S117N]
Residue:238
BDBM18781
BDBM18044
NameBDBM18781
Synonyms:5-(4-bromophenyl)-6-ethylpyrimidine-2,4-diamine P21
TypeSmall organic molecule
Emp. Form.C12H13BrN4
Mol. Mass.293.162
SMILESCCc1nc(N)nc(N)c1-c1ccc(Br)cc1