Reaction Details
TargetAlpha-1,6-mannosyl-glycoprotein 2-beta-N-acetylglucosaminyltransferase
LigandBDBM235245
Substrate/Competitorn/a
Meas. Tech.LCMS Assay
IC50 1.000±n/a nM
Citation Ahmad, SNegash, LA Dihydropyridinone MGAT2 inhibitors US Patent US9822074 Publication Date 11/21/2017
 
Alpha-1,6-mannosyl-glycoprotein 2-beta-N-acetylglucosaminyltransferase
Name:Alpha-1,6-mannosyl-glycoprotein 2-beta-N-acetylglucosaminyltransferase
Type:n/a
Mol. Mass.:51567.80
Organism:Homo sapiens (Human)
Description:Q10469
Residue:447
BDBM235245
NameBDBM235245
Synonyms:US9365558, 68 | US9822074, 68
TypeSmall organic molecule
Emp. Form.C29H29F7N2O5S
Mol. Mass.650.605
SMILESCS(=O)(=O)NC(=O)C1=C(C[C@](NC1=O)(c1ccc(OCCCCCC(F)(F)F)cc1F)C(F)(F)F)c1ccc(cc1)C1CC1