Reaction Details
TargetAlpha-1,6-mannosyl-glycoprotein 2-beta-N-acetylglucosaminyltransferase
LigandBDBM235247
Substrate/Competitorn/a
Meas. Tech.LCMS Assay
IC50 2.00±n/a nM
Citation Ahmad, SNegash, LA Dihydropyridinone MGAT2 inhibitors US Patent US9822074 Publication Date 11/21/2017
 
Alpha-1,6-mannosyl-glycoprotein 2-beta-N-acetylglucosaminyltransferase
Name:Alpha-1,6-mannosyl-glycoprotein 2-beta-N-acetylglucosaminyltransferase
Type:n/a
Mol. Mass.:51567.80
Organism:Homo sapiens (Human)
Description:Q10469
Residue:447
BDBM235247
NameBDBM235247
Synonyms:US9365558, 70 | US9822074, 70
TypeSmall organic molecule
Emp. Form.C26H24F7N3O5S2
Mol. Mass.655.605
SMILESFc1cc(OCCCC(F)(F)F)ccc1[C@@]1(CC(c2ncc(s2)C2CC2)=C(C(=O)NS(=O)(=O)C2CC2)C(=O)N1)C(F)(F)F