Reaction Details
TargetBifunctional dihydrofolate reductase-thymidylate synthase
LigandBDBM18793
Substrate/CompetitorBDBM18044
Meas. Tech.Antimalarial Testing In Vitro (IC50) and Measurement of Inhibition Constant (Ki)
pH7±n/a
Temperature298.15±n/a K
Ki 0.02±0.01 nM
IC50 2.3±1 nM
Citation Yuvaniyama, JChitnumsub, PKamchonwongpaisan, SVanichtanankul, JSirawaraporn, WTaylor, PWalkinshaw, MDYuthavong, Y Insights into antifolate resistance from malarial DHFR-TS structures. Nat Struct Biol10:257-65 (2003) 
 
Bifunctional dihydrofolate reductase-thymidylate synthase
Name:Bifunctional dihydrofolate reductase-thymidylate synthase
Type:Enzyme
Mol. Mass.:71822.51
Organism:Plasmodium falciparum (isolate K1 / Thailand)
Description:The mutant clone was prepared by cassette mutagenesis using wildtype pfDHFR as a template, and expressed in E. coli.
Residue:608
BDBM18793
BDBM18044
NameBDBM18793
Synonyms:6,6-dimethyl-1-[3-(2,4,5-trichlorophenoxy)propoxy]-1,6-dihydro-1,3,5-triazine-2,4-diamine WR99210
TypeSmall organic molecule
Emp. Form.C14H18Cl3N5O2
Mol. Mass.394.684
SMILESCC1(C)N=C(N)N=C(N)N1OCCCOc1cc(Cl)c(Cl)cc1Cl