Reaction Details
TargetDihydrofolate reductase
LigandBDBM18245
Substrate/CompetitorBDBM18044
Meas. Tech.Dihydrofolate Reductase (DHFR) Assay
pH7.4±n/a
Temperature303.15±n/a K
IC50 210±n/a nM
EC50 190±10 nM
CommentsEC50 was obtained from growth inhibition of parental CCRF-CEM human Leukemia cells.
Citation Gangjee, ALin, XKisliuk, RLMcGuire, JJ Synthesis of N-{4-[(2,4-diamino-5-methyl-4,7-dihydro-3H-pyrrolo[2,3-d]pyrimidin-6-yl)thio]benzoyl}-L-glutamic acid and N-{4-[(2-amino-4-oxo-5-methyl-4,7-dihydro-3H-pyrrolo[2,3-d]pyrimidin-6-yl)thio]benzoyl}-L-glutamic acid as dual inhibitors of dihydrofolate reductase and thymidylate synthase and a J Med Chem48:7215-22 (2005) 
 
Dihydrofolate reductase
Name:Dihydrofolate reductase
Type:Enzyme
Mol. Mass.:21453.99
Organism:Homo sapiens (Human)
Description:Recombinant human DHFR.
Residue:187
BDBM18245
BDBM18044
NameBDBM18245
Synonyms:(2S)-2-{[4-({2,4-diamino-5-methyl-7H-pyrrolo[2,3-d]pyrimidin-6-yl}sulfanyl)phenyl]formamido}pentanedioic acid Pyrrolo[2, 3-d]pyrimidine analogue, 1a
TypeSmall organic molecule
Emp. Form.C19H20N6O5S
Mol. Mass.444.464
SMILESCc1c(Sc2ccc(cc2)C(=O)N[C@@H](CCC(O)=O)C(O)=O)[nH]c2nc(N)nc(N)c12