Reaction Details
TargetCoagulation factor XI
LigandBDBM246174
Substrate/Competitorn/a
Meas. Tech.Inhibition Assay
IC50 0.700±n/a nM
Citation Röhrig, SHillisch, AStrassburger, JHeitmeier, SSchmidt, MVSchlemmer, KTersteegen, ABuchmüller, AGerdes, CSchäfer, MKinzel, TTeller, HSchirok, HKlar, JNunez, EJ Substituted oxopyridine derivatives and use thereof in the treatment of cardiovascular disorders US Patent US9822102 Publication Date 11/21/2017
 
Coagulation factor XI
Name:Coagulation factor XI
Type:Enzyme
Mol. Mass.:70130.58
Organism:Homo sapiens (Human)
Description:P03951
Residue:625
BDBM246174
NameBDBM246174
Synonyms:US10183932, Example 81 US9434690, 80 US9822102, Example 81
TypeSmall organic molecule
Emp. Form.C26H24ClN3O6
Mol. Mass.509.938
SMILESCO[C@@H](C)CC(C(=O)Nc1ccc(cc1)C(O)=O)n1cc(OC)c(cc1=O)-c1cc(Cl)ccc1C#N