Reaction Details
TargetThymidylate synthase
LigandBDBM18799
Substrate/CompetitorBDBM18754
Meas. Tech.Thymidylate Synthase (TS) Assay
IC50>23000±n/a nM
Citation Gangjee, AJain, HDPhan, JLin, XSong, XMcGuire, JJKisliuk, RL Dual inhibitors of thymidylate synthase and dihydrofolate reductase as antitumor agents: design, synthesis, and biological evaluation of classical and nonclassical pyrrolo[2,3-d]pyrimidine antifolates(1). J Med Chem49:1055-65 (2006) 
 
Thymidylate synthase
Name:Thymidylate synthase
Type:Enzyme
Mol. Mass.:30475.81
Organism:Escherichia coli
Description:n/a
Residue:264
BDBM18799
BDBM18754
NameBDBM18799
Synonyms:2-amino-5-[(3,4-dichlorophenyl)sulfanyl]-6-ethyl-3H,4H,7H-pyrrolo[2,3-d]pyrimidin-4-one | Pyrrolo[2,3-d]pyrimidine analogue, 5
TypeSmall organic molecule
Emp. Form.C14H12Cl2N4OS
Mol. Mass.355.242
SMILESCCc1[nH]c2nc(N)[nH]c(=O)c2c1Sc1ccc(Cl)c(Cl)c1