Reaction Details
TargetThymidylate synthase
LigandBDBM18803
Substrate/CompetitorBDBM18754
Meas. Tech.Thymidylate Synthase (TS) Assay
IC50>26000±n/a nM
Citation Gangjee, AJain, HDPhan, JLin, XSong, XMcGuire, JJKisliuk, RL Dual inhibitors of thymidylate synthase and dihydrofolate reductase as antitumor agents: design, synthesis, and biological evaluation of classical and nonclassical pyrrolo[2,3-d]pyrimidine antifolates(1). J Med Chem49:1055-65 (2006) 
 
Thymidylate synthase
Name:Thymidylate synthase
Type:Enzyme
Mol. Mass.:30475.81
Organism:Escherichia coli
Description:n/a
Residue:264
BDBM18803
BDBM18754
NameBDBM18803
Synonyms:2-amino-5-[(3-chlorophenyl)sulfanyl]-6-ethyl-3H,4H,7H-pyrrolo[2,3-d]pyrimidin-4-one | Pyrrolo[2,3-d]pyrimidine analogue, 11
TypeSmall organic molecule
Emp. Form.C14H13ClN4OS
Mol. Mass.320.797
SMILESCCc1[nH]c2nc(N)[nH]c(=O)c2c1Sc1cccc(Cl)c1