Reaction Details
TargetThymidylate synthase
LigandBDBM18805
Substrate/CompetitorBDBM18754
Meas. Tech.Thymidylate Synthase (TS) Assay
IC50>20000±n/a nM
Citation Gangjee, AJain, HDPhan, JLin, XSong, XMcGuire, JJKisliuk, RL Dual inhibitors of thymidylate synthase and dihydrofolate reductase as antitumor agents: design, synthesis, and biological evaluation of classical and nonclassical pyrrolo[2,3-d]pyrimidine antifolates(1). J Med Chem49:1055-65 (2006) 
 
Thymidylate synthase
Name:Thymidylate synthase
Type:Enzyme
Mol. Mass.:30475.81
Organism:Escherichia coli
Description:n/a
Residue:264
BDBM18805
BDBM18754
NameBDBM18805
Synonyms:2-amino-5-{[3,5-bis(trifluoromethyl)phenyl]sulfanyl}-6-ethyl-3H,4H,7H-pyrrolo[2,3-d]pyrimidin-4-one | Pyrrolo[2,3-d]pyrimidine analogue, 14
TypeSmall organic molecule
Emp. Form.C16H12F6N4OS
Mol. Mass.422.348
SMILESCCc1[nH]c2nc(N)[nH]c(=O)c2c1Sc1cc(cc(c1)C(F)(F)F)C(F)(F)F