Reaction Details
TargetThyroid hormone receptor alpha
LigandBDBM18860
Substrate/CompetitorBDBM18860
Meas. Tech.TRalpha-Binding Assay and Thyroid Response Element (TRAFalpha1) Reporter Assay.
pH7±n/a
Temperature277.15±n/a K
IC50 0.24±n/a nM
Citation Garg, NLi, YLGarcia Collazo, AMLitten, CRyono, DEZhang, MCaringal, YBrigance, RPMeng, WWashburn, WNAgback, PMellström, KRehnmark, SRahimi-Ghadim, MNorin, TGrynfarb, MSandberg, JGrover, GMalm, J Thyroid receptor ligands. Part 8: Thyromimetics derived from N-acylated-alpha-amino acid derivatives displaying modulated pharmacological selectivity compared with KB-141. Bioorg Med Chem Lett17:4131-4 (2007) 
 
Thyroid hormone receptor alpha
Name:Thyroid hormone receptor alpha
Type:Receptor
Mol. Mass.:54818.00
Organism:Homo sapiens (Human)
Description:Recombinant hThR was obtained from nuclear extracts from SF9 cells infected with baculovirus vectors encoding for ThRalpha 1.
Residue:490
BDBM18860
BDBM18860
NameBDBM18860
Synonyms:(2R)-2-amino-3-[4-(4-hydroxy-3-iodophenoxy)-3,5-diiodophenyl]propanoic acid 3,5,3'-triiodo-L-thyronine (T3) Triiodothyronine US10544075, Compound T3 liothyronine | triothyrone
TypeHormone
Emp. Form.C15H12I3NO4
Mol. Mass.650.9735
SMILESN[C@@H](Cc1cc(I)c(Oc2ccc(O)c(I)c2)c(I)c1)C(O)=O