Reaction Details
TargetThyroid hormone receptor alpha
LigandBDBM18867
Substrate/CompetitorBDBM18860
Meas. Tech.TRalpha-Binding Assay and Thyroid Response Element (TRAFalpha1) Reporter Assay.
pH7±n/a
Temperature277.15±n/a K
IC50 1.4±0.44 nM
EC50 0.38±n/a nM
Citation Garg, NLi, YLGarcia Collazo, AMLitten, CRyono, DEZhang, MCaringal, YBrigance, RPMeng, WWashburn, WNAgback, PMellström, KRehnmark, SRahimi-Ghadim, MNorin, TGrynfarb, MSandberg, JGrover, GMalm, J Thyroid receptor ligands. Part 8: Thyromimetics derived from N-acylated-alpha-amino acid derivatives displaying modulated pharmacological selectivity compared with KB-141. Bioorg Med Chem Lett17:4131-4 (2007) 
 
Thyroid hormone receptor alpha
Name:Thyroid hormone receptor alpha
Type:Receptor
Mol. Mass.:54818.00
Organism:Homo sapiens (Human)
Description:Recombinant hThR was obtained from nuclear extracts from SF9 cells infected with baculovirus vectors encoding for ThRalpha 1.
Residue:490
BDBM18867
BDBM18860
NameBDBM18867
Synonyms:2-{3,5-dibromo-4-[4-hydroxy-3-(propan-2-yl)phenoxy]phenyl}acetic acid dibromo phenylacetic acid, 11a
TypeSmall organic molecule
Emp. Form.C17H16Br2O4
Mol. Mass.444.115
SMILESCC(C)c1cc(Oc2c(Br)cc(CC(O)=O)cc2Br)ccc1O