Reaction Details
TargetThyroid hormone receptor alpha
LigandBDBM18872
Substrate/CompetitorBDBM18860
Meas. Tech.TRalpha-Binding Assay and Thyroid Response Element (TRAFalpha1) Reporter Assay.
pH7±n/a
Temperature277.15±n/a K
IC50 10±n/a nM
EC50 7.2±n/a nM
Citation Garg, NLi, YLGarcia Collazo, AMLitten, CRyono, DEZhang, MCaringal, YBrigance, RPMeng, WWashburn, WNAgback, PMellström, KRehnmark, SRahimi-Ghadim, MNorin, TGrynfarb, MSandberg, JGrover, GMalm, J Thyroid receptor ligands. Part 8: Thyromimetics derived from N-acylated-alpha-amino acid derivatives displaying modulated pharmacological selectivity compared with KB-141. Bioorg Med Chem Lett17:4131-4 (2007) 
 
Thyroid hormone receptor alpha
Name:Thyroid hormone receptor alpha
Type:Receptor
Mol. Mass.:54818.00
Organism:Homo sapiens (Human)
Description:Recombinant hThR was obtained from nuclear extracts from SF9 cells infected with baculovirus vectors encoding for ThRalpha 1.
Residue:490
BDBM18872
BDBM18860
NameBDBM18872
Synonyms:(2S)-2-(1-{3,5-dibromo-4-[4-hydroxy-3-(propan-2-yl)phenoxy]phenyl}acetamido)propanoic acid | N-acylated-alpha-amino acid derivative, 3b
TypeSmall organic molecule
Emp. Form.C20H21Br2NO5
Mol. Mass.515.192
SMILESCC(C)c1cc(Oc2c(Br)cc(CC(=O)N[C@@H](C)C(O)=O)cc2Br)ccc1O