Reaction Details
TargetThyroid hormone receptor alpha
LigandBDBM18877
Substrate/CompetitorBDBM18860
Meas. Tech.TRalpha-Binding Assay and Thyroid Response Element (TRAFalpha1) Reporter Assay.
pH7±n/a
Temperature277.15±n/a K
IC50 5.5±0.29 nM
EC50 1.5±n/a nM
Citation Garg, NLi, YLGarcia Collazo, AMLitten, CRyono, DEZhang, MCaringal, YBrigance, RPMeng, WWashburn, WNAgback, PMellström, KRehnmark, SRahimi-Ghadim, MNorin, TGrynfarb, MSandberg, JGrover, GMalm, J Thyroid receptor ligands. Part 8: Thyromimetics derived from N-acylated-alpha-amino acid derivatives displaying modulated pharmacological selectivity compared with KB-141. Bioorg Med Chem Lett17:4131-4 (2007) 
 
Thyroid hormone receptor alpha
Name:Thyroid hormone receptor alpha
Type:Receptor
Mol. Mass.:54818.00
Organism:Homo sapiens (Human)
Description:Recombinant hThR was obtained from nuclear extracts from SF9 cells infected with baculovirus vectors encoding for ThRalpha 1.
Residue:490
BDBM18877
BDBM18860
NameBDBM18877
Synonyms:(2R)-2-(1-{3,5-dibromo-4-[4-hydroxy-3-(propan-2-yl)phenoxy]phenyl}acetamido)-2-phenylacetic acid | N-acylated-alpha-amino acid derivative, 3g
TypeSmall organic molecule
Emp. Form.C25H23Br2NO5
Mol. Mass.577.262
SMILESCC(C)c1cc(Oc2c(Br)cc(CC(=O)N[C@@H](C(O)=O)c3ccccc3)cc2Br)ccc1O