Reaction Details
TargetThyroid hormone receptor beta
LigandBDBM18874
Substrate/CompetitorBDBM18860
Meas. Tech.TRbeta-Binding Assay and Thyroid Response Element (TRAFbeta1) Reporter Assay.
pH7±n/a
Temperature277.15±n/a K
IC50 0.27±0.0018 nM
EC50 0.77±n/a nM
Citation Garg, NLi, YLGarcia Collazo, AMLitten, CRyono, DEZhang, MCaringal, YBrigance, RPMeng, WWashburn, WNAgback, PMellström, KRehnmark, SRahimi-Ghadim, MNorin, TGrynfarb, MSandberg, JGrover, GMalm, J Thyroid receptor ligands. Part 8: Thyromimetics derived from N-acylated-alpha-amino acid derivatives displaying modulated pharmacological selectivity compared with KB-141. Bioorg Med Chem Lett17:4131-4 (2007) 
 
Thyroid hormone receptor beta
Name:Thyroid hormone receptor beta
Type:Receptor
Mol. Mass.:52793.62
Organism:Homo sapiens (Human)
Description:Recombinant hThR was obtained from nuclear extracts from SF9 cells infected with baculovirus vectors encoding for ThRbeta 1.
Residue:461
BDBM18874
BDBM18860
NameBDBM18874
Synonyms:(2S)-2-(1-{3,5-dibromo-4-[4-hydroxy-3-(propan-2-yl)phenoxy]phenyl}acetamido)-3-methylbutanoic acid | N-acylated-alpha-amino acid derivative, 3d
TypeSmall organic molecule
Emp. Form.C22H25Br2NO5
Mol. Mass.543.246
SMILESCC(C)[C@H](NC(=O)Cc1cc(Br)c(Oc2ccc(O)c(c2)C(C)C)c(Br)c1)C(O)=O