Reaction Details
TargetThyroid hormone receptor alpha
LigandBDBM18884
Substrate/CompetitorBDBM18860
Meas. Tech.TRalpha-Binding Assay.
pH7±n/a
Temperature277.15±n/a K
IC50 200±60 nM
CommentsResult was taken from literature.
Citation Malm, JGordon, SBrandt, PCarlsson, BAgback, PBäckbro Saeidi, ASandberg, J Thyroid receptor ligands. Part 7: Indirect antagonists of the thyroid hormone receptor with improved affinity. Bioorg Med Chem Lett17:2018-21 (2007) 
 
Thyroid hormone receptor alpha
Name:Thyroid hormone receptor alpha
Type:Receptor
Mol. Mass.:54818.00
Organism:Homo sapiens (Human)
Description:Recombinant hThR was obtained from nuclear extracts from SF9 cells infected with baculovirus vectors encoding for ThRalpha 1.
Residue:490
BDBM18884
BDBM18860
NameBDBM18884
Synonyms:2-(4-{[4-hydroxy-3-(4-nitrophenyl)-5-(propan-2-yl)phenyl]methyl}-3,5-dimethylphenoxy)acetic acid JMC496635 Compound 4 | thyromimetic, 5a
TypeSmall organic molecule
Emp. Form.C26H27NO6
Mol. Mass.449.4957
SMILESCC(C)c1cc(Cc2c(C)cc(OCC(O)=O)cc2C)cc(c1O)-c1ccc(cc1)[N+]([O-])=O