Reaction Details
TargetThyroid hormone receptor beta
LigandBDBM18883
Substrate/CompetitorBDBM18860
Meas. Tech.TRbeta-Binding Assay
pH7±n/a
Temperature277.15±n/a K
IC50 910±n/a nM
Citation Malm, JGordon, SBrandt, PCarlsson, BAgback, PBäckbro Saeidi, ASandberg, J Thyroid receptor ligands. Part 7: Indirect antagonists of the thyroid hormone receptor with improved affinity. Bioorg Med Chem Lett17:2018-21 (2007) 
 
Thyroid hormone receptor beta
Name:Thyroid hormone receptor beta
Type:Receptor
Mol. Mass.:52793.62
Organism:Homo sapiens (Human)
Description:Recombinant hThR was obtained from nuclear extracts from SF9 cells infected with baculovirus vectors encoding for ThRbeta 1.
Residue:461
BDBM18883
BDBM18860
NameBDBM18883
Synonyms:3,5-dibromo-4-[4-hydroxy-3,5-bis(propan-2-yl)phenoxy]benzoic acid thyromimetic, 4
TypeSmall organic molecule
Emp. Form.C19H20Br2O4
Mol. Mass.472.168
SMILESCC(C)c1cc(Oc2c(Br)cc(cc2Br)C(O)=O)cc(C(C)C)c1O