Reaction Details
TargetThyroid hormone receptor beta
LigandBDBM18927
Substrate/CompetitorBDBM18860
Meas. Tech.TRalpha-Binding Assay.
IC50 0.77±n/a nM
Citation Hangeland, JJDoweyko, AMDejneka, TFriends, TJDevasthale, PMellström, KSandberg, JGrynfarb, MSack, JSEinspahr, HFärnegård, MHusman, BLjunggren, JKoehler, KSheppard, CMalm, JRyono, DE Thyroid receptor ligands. Part 2: Thyromimetics with improved selectivity for the thyroid hormone receptor beta. Bioorg Med Chem Lett14:3549-53 (2004) 
 
Thyroid hormone receptor beta
Name:Thyroid hormone receptor beta
Type:Receptor
Mol. Mass.:52793.62
Organism:Homo sapiens (Human)
Description:Recombinant hThR was obtained from nuclear extracts from SF9 cells infected with baculovirus vectors encoding for ThRbeta 1.
Residue:461
BDBM18927
BDBM18860
NameBDBM18927
Synonyms:2-(3,5-dichloro-4-{3-[3-(difluoromethoxy)phenyl]-4-hydroxyphenoxy}phenyl)acetic acid | 4-hydroxy thyromimetic, 9i
TypeSmall organic molecule
Emp. Form.C21H14Cl2F2O5
Mol. Mass.455.236
SMILESOC(=O)Cc1cc(Cl)c(Oc2ccc(O)c(c2)-c2cccc(OC(F)F)c2)c(Cl)c1