Reaction Details
TargetThyroid hormone receptor alpha
LigandBDBM18886
Substrate/CompetitorBDBM18860
Meas. Tech.TRalpha-Binding Assay and Thyroid Response Element (TRAFalpha1) Reporter Assay.
pH7±n/a
Temperature277.15±n/a K
IC50 36±3 nM
EC50 32±n/a nM
Commentsantagonist
Citation Koehler, KGordon, SBrandt, PCarlsson, BBäcksbro-Saeidi, AApelqvist, TAgback, PGrover, GJNelson, WGrynfarb, MFärnegård, MRehnmark, SMalm, J Thyroid receptor ligands. 6. A high affinity "direct antagonist" selective for the thyroid hormone receptor. J Med Chem49:6635-7 (2006) 
 
Thyroid hormone receptor alpha
Name:Thyroid hormone receptor alpha
Type:Receptor
Mol. Mass.:54818.00
Organism:Homo sapiens (Human)
Description:Recombinant hThR was obtained from nuclear extracts from SF9 cells infected with baculovirus vectors encoding for ThRalpha 1.
Residue:490
BDBM18886
BDBM18860
NameBDBM18886
Synonyms:3-{3,5-dibromo-4-[4-hydroxy-3-(propan-2-yl)-5-[(E)-2-(pyridin-4-yl)ethenyl]phenoxy]phenyl}propanoic acid thyromimetic, 6
TypeSmall organic molecule
Emp. Form.C25H23Br2NO4
Mol. Mass.561.262
SMILESCC(C)c1cc(Oc2c(Br)cc(CCC(O)=O)cc2Br)cc(\C=C\c2ccncc2)c1O