Reaction Details
TargetThyroid hormone receptor beta
LigandBDBM18887
Substrate/CompetitorBDBM18860
Meas. Tech.TRbeta-Binding Assay
pH7±n/a
Temperature277.15±n/a K
IC50 190±n/a nM
Citation Koehler, KGordon, SBrandt, PCarlsson, BBäcksbro-Saeidi, AApelqvist, TAgback, PGrover, GJNelson, WGrynfarb, MFärnegård, MRehnmark, SMalm, J Thyroid receptor ligands. 6. A high affinity "direct antagonist" selective for the thyroid hormone receptor. J Med Chem49:6635-7 (2006) 
 
Thyroid hormone receptor beta
Name:Thyroid hormone receptor beta
Type:Receptor
Mol. Mass.:52793.62
Organism:Homo sapiens (Human)
Description:Recombinant hThR was obtained from nuclear extracts from SF9 cells infected with baculovirus vectors encoding for ThRbeta 1.
Residue:461
BDBM18887
BDBM18860
NameBDBM18887
Synonyms:3,5-Dibromo-4-alkoxyphenylalkanoic Acid, 9k JMC496635 Compound 9 | cyclohexyl derivative, 7
TypeSmall organic molecule
Emp. Form.C16H20Br2O3
Mol. Mass.420.136
SMILESOC(=O)CCc1cc(Br)c(OCC2CCCCC2)c(Br)c1