Reaction Details
TargetCoagulation factor X
LigandBDBM18978
Substrate/CompetitorBDBM12500
Meas. Tech.Enzyme Assay and Determination of the Inhibition Constants.
pH7±n/a
Temperature295.15±n/a K
Ki 1.4±n/a nM
Citation Lam, PYClark, CGLi, RPinto, DJOrwat, MJGalemmo, RAFevig, JMTeleha, CAAlexander, RSSmallwood, AMRossi, KAWright, MRBai, SAHe, KLuettgen, JMWong, PCKnabb, RMWexler, RR Structure-based design of novel guanidine/benzamidine mimics: potent and orally bioavailable factor Xa inhibitors as novel anticoagulants. J Med Chem46:4405-18 (2003) 
 
Coagulation factor X
Name:Coagulation factor X
Type:Enzyme
Mol. Mass.:54726.60
Organism:Homo sapiens (Human)
Description:n/a
Residue:488
BDBM18978
BDBM12500
NameBDBM18978
Synonyms:1-(3-amino-1,2-benzoxazol-5-yl)-3-methyl-N-[4-(2-sulfamoylphenyl)phenyl]-1H-pyrazole-5-carboxamide | pyrazole-based inhibitor, 23a
TypeSmall organic molecule
Emp. Form.C24H20N6O4S
Mol. Mass.488.518
SMILESCc1cc(C(=O)Nc2ccc(cc2)-c2ccccc2S(N)(=O)=O)n(n1)-c1ccc2onc(N)c2c1