Reaction Details
TargetCoagulation factor X
LigandBDBM18983
Substrate/CompetitorBDBM12500
Meas. Tech.Enzyme Assay and Determination of the Inhibition Constants.
pH7±n/a
Temperature295.15±n/a K
Ki 16±n/a nM
Citation Lam, PYClark, CGLi, RPinto, DJOrwat, MJGalemmo, RAFevig, JMTeleha, CAAlexander, RSSmallwood, AMRossi, KAWright, MRBai, SAHe, KLuettgen, JMWong, PCKnabb, RMWexler, RR Structure-based design of novel guanidine/benzamidine mimics: potent and orally bioavailable factor Xa inhibitors as novel anticoagulants. J Med Chem46:4405-18 (2003) 
 
Coagulation factor X
Name:Coagulation factor X
Type:Enzyme
Mol. Mass.:54726.60
Organism:Homo sapiens (Human)
Description:n/a
Residue:488
BDBM18983
BDBM12500
NameBDBM18983
Synonyms:1-(2,4-diaminoquinazolin-6-yl)-3-methyl-N-[4-(2-sulfamoylphenyl)phenyl]-1H-pyrazole-5-carboxamide | pyrazole-based inhibitor, 24b
TypeSmall organic molecule
Emp. Form.C25H22N8O3S
Mol. Mass.514.559
SMILESCc1cc(C(=O)Nc2ccc(cc2)-c2ccccc2S(N)(=O)=O)n(n1)-c1ccc2nc(N)nc(N)c2c1