Reaction Details
TargetCoagulation factor X
LigandBDBM19008
Substrate/CompetitorBDBM12500
Meas. Tech.Enzyme Assay and Determination of the Inhibition Constants.
Ki 0.14±n/a nM
Citation Pinto, DJOrwat, MJKoch, SRossi, KAAlexander, RSSmallwood, AWong, PCRendina, ARLuettgen, JMKnabb, RMHe, KXin, BWexler, RRLam, PY Discovery of 1-(4-Methoxyphenyl)-7-oxo-6-(4-(2-oxopiperidin-1-yl)phenyl)-4,5,6,7-tetrahydro- 1H-pyrazolo[3,4-c]pyridine-3-carboxamide (Apixaban, BMS-562247), a Highly Potent, Selective, Efficacious, and Orally Bioavailable Inhibitor of Blood Coagulation Factor Xa. J Med Chem50:5339-56 (2007) 
 
Coagulation factor X
Name:Coagulation factor X
Type:Enzyme
Mol. Mass.:54726.60
Organism:Homo sapiens (Human)
Description:n/a
Residue:488
BDBM19008
BDBM12500
NameBDBM19008
Synonyms:1-(4-methoxyphenyl)-6-(4-{2-[(methylamino)methyl]phenyl}phenyl)-7-oxo-1H,4H,5H,6H,7H-pyrazolo[3,4-c]pyridine-3-carboxamide CHEMBL237226
TypeSmall organic molecule
Emp. Form.C28H27N5O3
Mol. Mass.481.5457
SMILESCNCc1ccccc1-c1ccc(cc1)N1CCc2c(nn(c2C1=O)-c1ccc(OC)cc1)C(N)=O